{"text_format":"1","workbook":"xlsx","n_sheets":6,"sheets":["PSDS Instructions - START HERE","PSDS","PCDS Instructions","PCDS","Check Requirements - END HERE","Control"],"not_rendered":{"charts":0,"images":3,"macros":1,"external_links":0,"defined_names":3,"comments":2,"pivot_tables":0},"unopened":[],"bounds":{"document_bytes":16777216,"sheet_cells":100000,"rows_first":2000,"rows_last":500,"rows_between":2000,"halvings":0,"cell_chars":16384,"cell_head_chars":4096},"cells_cut":0,"cells_raw":0,"read":"whole","date_system":"1900"}

{"sheet":"PSDS Instructions - START HERE","index":0,"n_rows":65,"n_cols":4,"rows_kept":65,"cut":false,"hidden":false,"merged":[[32,2,32,3],[64,1,64,3],[52,2,52,3],[61,2,61,3],[62,1,62,3],[63,1,63,3],[59,1,59,3],[53,2,53,3],[55,1,55,3],[60,2,60,3],[56,2,56,3],[57,1,57,3],[58,2,58,3],[47,1,47,3],[48,2,48,3],[49,1,49,3],[51,2,51,3],[50,2,50,3],[1,1,4,3],[5,1,5,3],[6,2,6,3],[8,2,8,3],[13,2,13,3],[9,2,9,3],[12,2,12,3],[10,1,10,3],[11,2,11,3],[28,1,28,3],[29,2,29,3],[30,2,30,3],[24,2,24,3],[25,2,25,3],[26,2,26,3],[14,2,14,3],[16,2,16,3],[27,2,27,3],[23,2,23,3],[22,2,22,3],[21,1,21,3],[18,2,18,3],[15,2,15,3],[19,2,19,3],[20,2,20,3],[17,2,17,3],[16,1,17,1],[31,2,31,3],[54,2,54,3],[41,2,41,3],[33,2,33,3],[34,2,34,3],[35,2,35,3],[38,2,38,3],[39,2,39,3],[36,2,36,3],[37,1,37,3],[40,2,40,3],[42,1,42,3],[43,2,43,3],[44,1,44,3],[45,2,45,3],[46,2,46,3]]}
[]
[null,"PACKAGING SPECIFICATION DATA SHEET"]
[]
[]
[]
[null,"SUPPLIER INSTRUCTIONS"]
[null,"PACKAGING DATA SHEET (PDS) File Name","Name the PSDS File using the following convention: \n- Cummins Part No. (as defined by CMI Part Print), underscore\n- Supplier ID No. (SIDNNNNNN), underscore\n- Pack Type: (AAA) where pack type is defined as Expendable: (EXP), Returnable (RET), underscore \n- Submission Date (YYMMDD), underscore \n- Supplier Company Name"]
[null,"Example","For Part A123B456, Supplier # 678987, Expendable, April 22 2016, ACME Widget Company","A123B456_SID678987_EXP_160422_ACME Widget Company"]
[null,"SPECIAL INSTRUCTIONS\nDocument Submission Format","The Excel version of the PSDS is a working document submitted to the Cummins Sourcing Manager for approval.  Where traceability is required to track multiple suppler revisions, the supplier shall submit a like titled PDF document with the PSDS & PCDS included in the same file.  The Supplier Instructions for the PSDS & PCDS are NOT to be included in the PDF file."]
[null,"SPECIAL INSTRUCTIONS\nPicture Insert","Select 'Insert', 'Picture' on the main tool bar and select picture from source folder.  Resize the picture to fit the picture cell while holding the 'Shift Key' to maintain the aspect ratio.  Apply the appropriate photo resolution to optimize the size of the finished document. Low resolution is required for close-in photos - higher resolution for farther away photos."]
[null,"COMPONENT PART - PROPOSAL INFORMATION"]
[null,"PART NUMBER","Indicate the Part Number from the Cummins Engineering Drawing."]
[null,"REV LEVEL","Indicate the Revision Level from the Cummins Engineering Drawing."]
[null,"PART NAME","Indicate the Part Name from the Cummins Engineering Drawing using proper naming convention (Noun Name, Qualifier)."]
[null,"ANNUAL VOLUME","Indicated the estimated annual supply volume."]
[null,"PFEP","Indicate if Plan-For-Every-Part criteria was provided by Cummins and is the basis for the supplier proposal."]
[null,"PROPOSAL LEVEL","Indicate the Proposal Level of the document being submitted.  Initial submission is 'Preliminary'.  Each subsequent submission is 'Change' including a proposed change to an existing or approved proposal."]
[null,null,"Cummins Inc will indicate 'Final' state upon system approval of the proposal."]
[null,"SUBMISSION DATE","Indicate the Submission Date (DD-MMM-YYYY) of the document as it relates to the Proposal Level."]
[null,"TYPE","Indicate the type of packaging specification, EXPendable or RETurnable."]
{"$rows_left_out":46}
{"sheet":"PSDS","index":1,"n_rows":141,"n_cols":47,"rows_kept":141,"cut":false,"hidden":false,"merged":[[35,27,35,30],[36,24,36,26],[31,14,31,15],[30,20,30,21],[30,22,31,23],[30,24,30,28],[30,29,30,30],[31,1,31,3],[31,4,31,5],[31,6,31,7],[31,8,31,9],[31,10,31,11],[31,16,31,17],[30,1,30,3],[30,4,30,5],[30,6,30,9],[30,10,30,11],[30,16,30,17],[30,18,30,19],[31,18,31,19],[31,20,31,21],[31,24,31,28],[31,29,31,30],[36,27,36,30],[37,27,37,30],[37,24,37,26],[38,24,38,27],[38,28,38,30],[46,14,46,15],[47,1,47,30],[48,1,48,21],[48,22,49,30],[49,1,49,6],[49,7,49,21],[45,24,45,30],[46,24,46,30],[33,3,42,12],[43,3,44,12],[33,14,42,23],[43,14,44,23],[35,24,35,26],[42,24,42,30],[43,24,43,30],[44,24,44,30],[45,1,45,4],[45,5,45,6],[45,7,45,8],[45,9,45,10],[61,1,61,30],[62,1,62,30],[63,1,63,30],[64,1,64,30],[60,22,60,30],[50,22,59,30],[60,1,60,21],[57,13,57,19],[57,20,57,21],[59,1,59,6],[59,7,59,12],[59,13,59,18],[59,19,59,21],[58,1,58,6],[58,7,58,11],[58,12,58,21],[56,1,56,21],[57,1,57,12],[50,1,55,21],[45,16,45,17],[45,18,45,19],[45,20,45,21],[46,1,46,4],[46,5,46,6],[46,7,46,8],[46,9,46,10],[46,16,46,17],[46,18,46,19],[46,20,46,21],[18,14,27,23],[28,14,29,23],[29,24,29,30],[32,32,32,38],[33,1,44,1],[33,2,44,2],[33,13,44,13],[33,24,33,30],[33,32,34,38],[34,24,34,30],[36,32,37,33],[36,34,37,38],[38,32,39,33],[38,34,39,38],[40,32,41,33],[32,1,32,23],[32,24,32,28],[32,29,32,30],[40,34,41,38],[39,24,39,30],[42,32,43,33],[42,34,43,38],[40,24,40,30],[41,24,41,30],[16,32,16,38],[17,1,17,30],[17,32,17,38],[18,1,29,1],[18,2,29,2],[18,13,29,13],[18,24,18,30],[18,32,18,38],[27,32,27,38],[22,32,22,38],[23,24,23,28],[23,29,23,30],[24,24,24,28],[24,29,24,30],[25,24,28,30],[19,24,19,30],[20,24,20,28],[20,29,20,30],[21,24,21,28],[21,29,21,30],[22,24,22,28],[22,29,22,30],[18,3,27,12],[28,3,29,12],[14,16,14,21],[14,22,14,30],[15,6,15,15],[15,16,15,21],[15,22,15,30],[16,1,16,30],[11,1,11,30],[12,1,12,5],[12,6,12,15],[12,16,12,21],[12,22,12,30],[13,1,15,5],[13,6,13,15],[13,16,13,21],[13,22,13,30],[14,6,14,15],[9,1,9,5],[9,6,9,10],[9,16,9,21],[9,22,9,30],[10,1,10,30],[8,1,8,5],[8,6,8,15],[8,16,8,21],[8,22,8,25],[8,26,8,28],[8,29,8,30],[9,13,9,15],[9,11,9,12],[1,1,4,27],[5,1,5,30],[6,1,6,30],[7,1,7,5],[7,6,7,10],[7,11,7,13],[7,14,7,15],[7,16,7,21],[7,22,7,30]]}
[null,{"$f":"IF(OR(ISBLANK(G8),ISBLANK(G9),ISBLANK(G10),ISBLANK(W9),ISBLANK(W10),ISBLANK(G13),ISBLANK(G14),ISBLANK(W13),ISBLANK(W14),ISBLANK(W15),ISBLANK(W16),ISBLANK(AD21),ISBLANK(AD22),ISBLANK(AD23),ISBLANK(AD25),ISBLANK(Q47),ISBLANK(S47),ISBLANK(U47),ISBLANK(F47),ISBLANK(H47),ISBLANK(B58),ISBLANK(U58),ISBLANK(J47)),\"! Required entries are blank !\",\"\")","v":"! Required entries are blank !"},null,null,null,null,null,null,null,null,null,null,null,null,null,{"$f":"IF(OR(ISBLANK($G$8),ISBLANK($W$9),ISBLANK($G$13),ISBLANK($W$13)),\"\",\"Save this file with the name:\")","v":""},null,null,null,null,null,null,{"$f":"IF(OR(ISBLANK($G$8),ISBLANK($W$9),ISBLANK($G$13),ISBLANK($W$13)),\"\",G8&\"_\"&\"SID\"&W13&\"_\"&AD9&\"_\"&(TEXT(W9,\"yymmdd\"))&\"_\"&G13&\".xlsm\")","v":""}]
[null,"PACKAGING SPECIFICATION DATA SHEET"]
[]
[]
[]
[]
[]
[null,"PART NUMBER",null,null,null,null,null,null,null,null,null,"REV LEVEL",null,null,null,null,"PROPOSAL LEVEL",null,null,null,null,null,null,null,null,null,null,null,null,null,null,null,"Preliminary","Change"]
[null,"PART NAME",null,null,null,null,null,null,null,null,null,null,null,null,null,null,"SUBMISSION DATE",null,null,null,null,null,null,null,null,null,"TYPE",null,null,null,null,null,"EXP","RET"]
[null,"ANNUAL VOLUME",null,null,null,null,null,null,null,null,null,"PFEP",null,null,null,null,"SOURCING MGR EMAIL",null,null,null,null,null,null,null,null,null,null,null,null,null,null,null,"Using PFEP","No PFEP"]
[]
[null,"SUPPLIER INFORMATION"]
[null,"COMPANY NAME",null,null,null,null,null,null,null,null,null,null,null,null,null,null,"SUPPLIER ID NO.",null,null,null,null,null,null,null,null,null,null,null,null,null,null," ",6]
[null,"SUPPLIER ADDRESS   (POINT OF MANUFACTURE)",null,null,null,null,null,null,null,null,null,null,null,null,null,null,"PACKAGING ENGINEER"]
[null,null,null,null,null,null,null,null,null,null,null,null,null,null,null,null,"PHONE NUMBER"]
[null,null,null,null,null,null,null,null,null,null,null,null,null,null,null,null,"EMAIL ADDRESS"]
[]
[null,"PACKAGING DATA",null,null,null,null,null,null,null,null,null,null,null,null,null,null,null,null,null,null,null,null,null,null,null,null,null,null,null,null,null,null,"CONVERSION TABLE"]
[null,"PART ","(Display Single Part)","INSERT PHOTO",null,null,null,null,null,null,null,null,null,"INTERNAL DUNNAGE","INSERT PHOTO",null,null,null,null,null,null,null,null,null,"QTY & WEIGHT (kg)",null,null,null,null,null,null,null,"US CUSTOMARY UNITS TO METRIC"]
[null,null,null,null,null,null,null,null,null,null,null,null,null,null,null,null,null,null,null,null,null,null,null,null,"CALCULATIONS",null,null,null,null,null,null,null,null,"pounds","x",0.4536,"=",{"$f":"AJ20*AG20","v":0},"kilograms"]
{"$rows_left_out":122}
{"sheet":"PCDS Instructions","index":2,"n_rows":57,"n_cols":4,"rows_kept":57,"cut":false,"hidden":false,"merged":[[55,1,55,3],[56,1,56,3],[50,1,50,3],[51,2,51,3],[52,2,52,3],[53,1,53,3],[54,1,54,3],[45,2,45,3],[46,2,46,3],[47,2,47,3],[48,2,48,3],[49,2,49,3],[40,2,40,3],[41,1,41,3],[42,2,42,3],[43,2,43,3],[44,2,44,3],[39,2,39,3],[28,2,28,3],[29,2,29,3],[30,2,30,3],[31,2,31,3],[32,2,32,3],[33,2,33,3],[34,1,34,3],[36,2,36,3],[37,2,37,3],[38,2,38,3],[35,2,35,3],[10,2,11,2],[12,1,12,3],[14,1,15,1],[14,2,16,2],[27,2,27,3],[17,1,17,3],[18,2,18,3],[19,2,19,3],[20,2,20,3],[21,2,21,3],[22,2,22,3],[23,2,23,3],[24,1,24,3],[25,2,25,3],[26,2,26,3],[0,1,0,3],[1,1,4,3],[5,1,5,3],[6,1,6,3],[7,2,9,2]]}
[null,"CHECK YOUR WORK - CONFIRM CALCULATED FIELDS ACCURATE"]
[null,"PACKAGING COST DATA SHEET"]
[]
[]
[]
[null,"SUPPLIER INSTRUCTIONS"]
[null,"COMPONENT PART - PROPOSAL INFORMATION"]
[null,"PART NUMBER","All information in this section is the same as that of the corresponding PSDS section and is so structured to facilitate traceability of a printed copy.","PROPOSAL LEVEL"]
[null,"REV LEVEL",null,"SUBMISSION DATE"]
[null,"PART NAME",null,"REV LEVEL"]
[null,"ANNUAL VOLUME","Fields color coded blue contain information auto-populated from the corresponding field of the PSDS.","SOURCING MANAGER"]
[null,"PFEP PROVIDED"]
[null,"SUPPLIER INFORMATION"]
[null,"COMPANY NAME","Fields color coded blue contain information auto-populated from the corresponding field of the PSDS.","SUPPLIER ID NO."]
[null,"SUPPLIER ADDRESS (BUSINESS OFFICE)","Enter the Supplier Business Office Address and Commercial Contact Information.","SALES REPRESENTATIVE"]
[null,null,null,"PHONE NUMBER"]
[null,null,null,"EMAIL ADDRESS"]
[null,"PRIMARY CONTAINER INFORMATION"]
[null,"CONTAINER TYPE","Check box to indicate the design style of the primary container.  Check 'Other' and describe, if design style differs from choices provided."]
[null,"CONTAINER TARE WT","Please provide empty container/primary packaging weight. Empty container weight is weight of container without parts or internal dunnage. "]
{"$rows_left_out":38}
{"sheet":"PCDS","index":3,"n_rows":136,"n_cols":43,"rows_kept":136,"cut":false,"hidden":false,"merged":[[6,32,7,35],[112,1,112,30],[113,1,113,30],[83,27,83,29],[85,2,85,10],[85,11,85,13],[85,20,85,26],[85,27,85,29],[87,27,87,29],[83,2,83,4],[83,6,83,8],[83,11,83,13],[83,15,83,17],[83,19,83,21],[83,23,83,25],[92,1,92,30],[94,2,94,4],[94,6,94,8],[94,11,94,13],[94,14,94,18],[94,19,94,21],[94,23,94,25],[94,27,94,29],[104,6,104,8],[108,13,108,15],[102,27,102,29],[108,3,108,5],[89,6,89,8],[111,1,111,30],[91,1,91,30],[95,23,95,25],[104,27,104,29],[89,27,89,29],[95,2,95,4],[95,6,95,8],[95,10,95,14],[95,15,95,17],[95,19,95,21],[95,27,95,29],[96,2,96,4],[96,6,96,8],[98,2,98,4],[98,23,98,25],[98,27,98,29],[100,27,100,29],[108,23,108,25],[108,8,108,10],[108,18,108,20],[98,6,98,8],[79,19,79,21],[79,23,79,25],[79,27,79,29],[96,11,96,13],[96,15,96,17],[96,19,96,21],[96,23,96,25],[96,27,96,29],[81,27,81,29],[80,27,80,29],[98,11,98,13],[98,15,98,17],[98,19,98,21],[81,2,81,4],[81,6,81,8],[81,11,81,13],[81,15,81,17],[81,19,81,21],[81,23,81,25],[72,20,72,21],[72,23,72,24],[72,27,72,29],[74,15,74,25],[74,27,74,29],[72,6,72,8],[72,10,72,14],[80,2,80,4],[80,6,80,8],[80,10,80,14],[80,15,80,17],[80,19,80,21],[80,23,80,25],[77,1,77,30],[79,2,79,4],[79,6,79,8],[79,11,79,13],[79,14,79,18],[68,20,68,21],[68,23,68,24],[68,27,68,29],[70,20,70,21],[70,23,70,24],[70,27,70,29],[68,6,68,8],[70,6,70,8],[68,10,68,14],[70,10,70,14],[64,20,64,21],[64,23,64,24],[64,27,64,29],[66,20,66,21],[66,23,66,24],[66,27,66,29],[59,1,59,30],[60,27,60,29],[61,20,61,21],[61,23,61,24],[61,25,62,25],[61,27,61,29],[62,20,62,21],[62,23,62,24],[62,27,62,29],[62,6,62,8],[64,6,64,8],[66,6,66,8],[64,10,64,14],[66,10,66,14],[62,10,62,14],[56,27,56,29],[47,1,47,30],[48,27,48,29],[49,27,49,29],[52,27,52,29],[52,6,52,9],[54,6,54,9],[56,6,56,9],[52,11,52,17],[54,11,54,17],[56,11,56,17],[49,6,49,9],[49,11,49,17],[50,6,50,9],[50,11,50,17],[50,27,50,29],[44,27,44,29],[38,21,38,22],[38,24,38,25],[38,27,38,29],[40,21,40,22],[40,24,40,25],[40,27,40,29],[32,27,32,29],[54,27,54,29],[34,27,34,29],[36,21,36,22],[36,24,36,25],[36,27,36,29],[36,11,36,15],[42,21,42,22],[42,24,42,25],[42,27,42,29],[19,32,21,33],[19,34,21,38],[22,27,22,29],[22,32,24,33],[22,34,24,38],[40,11,40,15],[38,11,38,15],[26,10,26,11],[26,16,26,18],[26,20,26,25],[26,27,26,29],[29,1,29,30],[30,24,30,25],[14,32,15,33],[14,34,15,38],[15,6,15,15],[15,16,15,21],[15,22,15,30],[16,1,16,30],[16,32,18,33],[16,34,18,38],[17,1,17,30],[13,1,15,5],[13,6,13,15],[13,16,13,21],[13,22,13,30],[14,6,14,15],[14,16,14,21],[14,22,14,30],[10,32,10,38],[11,1,11,30],[11,32,12,38],[12,1,12,5],[12,6,12,15],[12,16,12,21],[12,22,12,30],[9,1,9,5],[9,6,9,10],[9,16,9,21],[9,22,9,30],[10,1,10,30],[9,13,9,15],[1,1,4,27],[5,1,5,30],[6,1,6,30],[7,1,7,5],[7,6,7,10],[7,11,7,13],[7,14,7,15],[7,16,7,21],[7,22,7,30],[8,1,8,5],[8,6,8,15],[8,16,8,21],[8,22,8,25],[42,11,42,15],[34,21,34,22],[34,24,34,25],[32,21,32,22],[32,24,32,25],[20,6,20,14],[22,6,22,14],[24,6,24,14],[24,20,24,29],[32,6,32,9],[32,11,32,15],[38,6,38,9],[40,6,40,9],[42,6,42,9],[8,26,8,28],[8,29,8,30],[31,21,31,22],[31,24,31,25],[31,27,31,29],[30,27,30,29],[100,2,100,10],[100,11,100,13],[100,20,100,26],[32,2,32,4],[34,2,34,4],[70,2,70,4],[72,2,72,4],[50,2,50,4],[52,2,52,4],[54,2,54,4],[56,2,56,4],[62,2,62,4],[64,2,64,4],[66,2,66,4],[68,2,68,4],[36,2,36,4],[38,2,38,4],[40,2,40,4],[42,2,42,4],[49,2,49,4],[44,16,44,25],[34,6,34,9],[36,6,36,9],[34,11,34,15]]}
[null,{"$f":"PSDS!B1","v":"! Required entries are blank !"}]
[null,"PACKAGING COST DATA SHEET"]
[]
[]
[]
[]
[null,"COMPONENT PART - PROPOSAL INFORMATION",null,null,null,null,null,null,null,null,null,null,null,null,null,null,null,null,null,null,null,null,null,null,null,null,null,null,null,null,null,null,"CONTAINER STYLE"]
[null,"PART NUMBER",null,null,null,null,{"$f":"IF(PSDS!G8<>\"\",PSDS!G8,\"\")","v":""},null,null,null,null,"REV LEVEL",null,null,{"$f":"IF(PSDS!O8<>\"\",PSDS!O8,\"\")","v":""},null,"PROPOSAL LEVEL",null,null,null,null,null,{"$f":"IF(PSDS!W8=\"\",\"\",PSDS!W8)","v":""}]
[null,"PART NAME",null,null,null,null,{"$f":"IF(PSDS!G9<>\"\",PSDS!G9,\"\")","v":""},null,null,null,null,null,null,null,null,null,"SUBMISSION DATE",null,null,null,null,null,{"$f":"IF(PSDS!W9=\"\",\"\",PSDS!W9)","v":""},null,null,null,"TYPE",null,null,{"$f":"IF(PSDS!AD9<>\"\",PSDS!AD9,\"\")","v":""},null,null,"RSC - 0201","HSC - 0200","FTD - 0301","FOL - 0203"]
[null,"ANNUAL VOLUME",null,null,null,null,{"$f":"IF(PSDS!G10<>\"\",PSDS!G10,\"\")","v":""},null,null,null,null,"PFEP",null,{"$f":"IF(PSDS!N10=\"\",\"\",PSDS!N10)","v":""},null,null,"SOURCING MANAGER",null,null,null,null,null,{"$f":"IF(PSDS!W10<>\"\",PSDS!W10,\"\")","v":""}]
[]
[null,"SUPPLIER INFORMATION",null,null,null,null,null,null,null,null,null,null,null,null,null,null,null,null,null,null,null,null,null,null,null,null,null,null,null,null,null,null,"COLOR LEGEND"]
[null,"COMPANY NAME",null,null,null,null,{"$f":"IF(PSDS!G13<>\"\",PSDS!G13,\"\")","v":""},null,null,null,null,null,null,null,null,null,"SUPPLIER ID NO.",null,null,null,null,null,{"$f":"IF(PSDS!W13<>\"\",PSDS!W13,\"\")","v":""}]
[null,"SUPPLIER ADDRESS            (BUSINESS OFFICE)",null,null,null,null,null,null,null,null,null,null,null,null,null,null,"SALES REPRESENTATIVE"]
[null,null,null,null,null,null,null,null,null,null,null,null,null,null,null,null,"PHONE NUMBER",null,null,null,null,null,null,null,null,null,null,null,null,null,null,null,"WHITE",null,"GENERAL INFORMATION - MANUAL INPUT"]
[null,null,null,null,null,null,null,null,null,null,null,null,null,null,null,null,"EMAIL ADDRESS"]
[null,null,null,null,null,null,null,null,null,null,null,null,null,null,null,null,null,null,null,null,null,null,null,null,null,null,null,null,null,null,null,null,"YELLOW",null,"COST INFORMATION - MANUAL INPUT"]
[null,"PRIMARY CONTAINER INFORMATION"]
[null,null,"EXPENDABLE CONTAINER TYPE"]
[null,null,null,null,null,null,null,null,null,null,null,null,null,null,null,null,null,null,null,null,null,null,null,null,null,null,null,null,null,null,null,null,"GREEN",null,"COST INFORMATION - CALCULATED"]
{"$rows_left_out":117}
{"sheet":"Check Requirements - END HERE","index":4,"n_rows":81,"n_cols":7,"rows_kept":81,"cut":false,"hidden":false,"merged":[[36,1,36,4],[42,1,42,4],[0,0,0,4],[3,8,3,13],[4,1,4,4],[12,1,12,4],[16,1,16,4],[18,1,18,4],[27,1,27,4],[14,1,14,4],[51,1,51,4],[54,1,54,4],[61,1,61,4],[74,1,74,4],[79,1,79,4]]}
["Note: For reference only. This is a list of General Packaging Requirements from the Cummins Global Packaging Standard for Production Parts intended to improve understanding during packaging development and review. Other requirements may apply and/or be discovered during the review process. Completing the checklist is recommended for suppliers but not required."]
["Sr. No","Ref. No","Description","Supplier Check","Cummins Check"]
["A","N/A","Quoted packaging cost matches Recurring Packaging Material Cost per Piece in PCDS"]
["B","N/A","PSDS and PCDS completed"]
[null,"5.1. Part Protection"]
[1,"5.1.1.","Plan the packaging such that parts may be removed without unnecessary handling."]
[2,"5.1.2.","Nested parts may be sequentially packed but shall be easily removed from the packaging.",null,null,null,"Complies"]
[3,"5.1.3.","Plan the packaging such that a safe and stable unit load is maintained in the “as packed” condition when the closure is removed.",null,null,null,"Exception"]
[4,"5.1.4.","Protect open holes of functional parts which may be adversely affected by contaminants.",null,null,null,"Request Clarification"]
[5,"5.1.5.","When plugs and caps are used they shall be easy to remove, but shall remain intact during transportation and handling.",null,null,null,"N/A"]
[6,"5.1.6.","Protect functional and pre-calibrated parts to the extent necessary to insure print specification compliance."]
[7,"5.1.7.","Protect special surfaces such as:\na. Machined Surfaces\nb. Finish painted or to be painted\nc. Finish plated or to be plated"]
[null,"5.2. Failsafing"]
[8,"5.2.","Packaging may be designed to failsafe our manufacturing processes and/or to facilitate assembly through the incorporation of a mistake-proofing function to the packaging and/or through part presentation."]
[null,"5.3. Part Cleanliness"]
[9,"5.3.","Supplier packaging and preservation methods shall protect for print specified part cleanliness\nrequirements. Parts that are not clean due to packaging debris will be considered out of\nspecification and may be subject to MNC or SCAR through the Part Quality System. The defect is considered a part specific defect even through the corrective action may require the Packaging Departments to lead the improvement. An example of this could be a part that has corrugated fiber or plastic shavings from dividers that have contaminated the part."]
[null,"5.4. Preservation and Shelf Life"]
[10,"5.4.","Preservation shall be sufficient to protect the product from any corrosion or deterioration for a period of 6 months for production parts and 18-months for aftermarket / Service parts, under normal warehouse storage and transportation conditions. The 6 or 18 month period begins when Cummins assumes title to the goods."]
[null,"5.5. Sustainability and Environmental Impact"]
[11,"5.5.1.","Packaging shall be created with consideration of all governmental regulations and environmental impact from packaging material selection through the end of life cycle."]
{"$rows_left_out":62}
{"sheet":"Control","index":5,"n_rows":11,"n_cols":4,"rows_kept":11,"cut":false,"hidden":true,"merged":[]}
["Minor Revision Date","Master Template Name","Master Template & Minor Revision Name","Minor Revision Log"]
["2020-08-14","CUMMINS_GLOBAL_PACKAGING_DATA_SHEET_REV_002",{"$f":"$B2&\"_\"&UPPER(TEXT($A2,\"MMMYYYY\"))","v":"CUMMINS_GLOBAL_PACKAGING_DATA_SHEET_REV_002_AUG2020"},"> Receiving Location list update - \"CNGE_Cummins Clovis Natural Gas Engine - Clovis, NM\" added\n\n> Receiving Location list update - \"RECON DTA - Megasite, Phaltan, India\" added"]
["2020-08-31","CUMMINS_GLOBAL_PACKAGING_DATA_SHEET_REV_002","CUMMINS_GLOBAL_PACKAGING_DATA_SHEET_REV_002_31AUG2020","> Updated data validation and input message on Sheet PSDS : Cell W13 to include SIM Ids that begin with “5” (and “6” to address that future evolution now)."]
["2020-09-29","CUMMINS_GLOBAL_PACKAGING_DATA_SHEET_REV_002","CUMMINS_GLOBAL_PACKAGING_DATA_SHEET_REV_002_29SEP2020","> Updated list of values on BANDNG measurement on PSDS to exclude blank values so Suppliers don't input values other than listed."]
["2020-10-27","CUMMINS_GLOBAL_PACKAGING_DATA_SHEET_REV_002","CUMMINS_GLOBAL_PACKAGING_DATA_SHEET_REV_002_27OCT2020","1.\tMinor Changes: Removed gridview on PSDS and PCDS Sheet and colored all the list of values white font so they are not visible to users.\n2.\tPSDS Sheet: Included Data validation to use manual values rather than from cell range (to make it case sensitive as is on list of values).\n3.\tUpdated data validation comment on Pallet deckboard spacing list of values cell to reflect \"section 5.7.2.1. Pallet Design Requirements\"."]
["2021-03-16","CUMMINS_GLOBAL_PACKAGING_DATA_SHEET_REV_002","CUMMINS_GLOBAL_PACKAGING_DATA_SHEET_REV_002_16MAR2021","Add\nCES - ESJ_Cummins Emission Solutions - El Paso, TX, Juarez, Mexico\nPDC - DAV_United Kingdom Logistics Center - Daventry,UK\n\nRemoved\nLEGACY_CTT - PP_Cummins Turbo Technology - Palmetto - Ladson, USA\nLEGACY_PDC - MDC_Parts Distribution Center  - Memphis, TN, USA\nPDC - CPG_Cummins Power Generation - Parts Distribution Center - Memphis, TN,USA\nFBU - FMX_Cummins Filtration  - San Luis Potosi, Mexico\nCPG - KENT_Cummins Power Generation - Kent, UK"]
["2021-04-28","CUMMINS_GLOBAL_PACKAGING_DATA_SHEET_REV_002",{"$f":"$B7&\"_\"&UPPER(TEXT($A7,\"MMMYYYY\"))","v":"CUMMINS_GLOBAL_PACKAGING_DATA_SHEET_REV_002_APR2021"},"NPBU receiving locations updated from EPBU designations to reflect true business unit.\n\nNPBU Herten, Germany receiving location added.\n\nPSDS instructions updated to account for 2019 Revision 002 structural changes: part preservation section added.\n\nPSDS and PCDS instruction worksheets received format update to improve readability for suppliers."]
["2021-05-11","CUMMINS_GLOBAL_PACKAGING_DATA_SHEET_REV_002",{"$f":"$B8&\"_\"&UPPER(TEXT($A8,\"MMMYYYY\"))","v":"CUMMINS_GLOBAL_PACKAGING_DATA_SHEET_REV_002_MAY2021"},"PSDS Instructions -  Cummins Location instruction reverted to old definition. ISPM-15 instruction added to form.\n\nPSDS & PCDS Instructions - Rev listing (bottom, in red) corrected to reflect current master revision (PDS - REV 002 - DEC 2019)\n\nPSDS - Corrected spelling error that has been present since December 2019 (\"RECEVING LONCATION' became \"RECEIVING LOCATION\")"]
["2021-05-18","CUMMINS_GLOBAL_PACKAGING_DATA_SHEET_REV_002",{"$f":"$B9&\"_\"&UPPER(TEXT($A9,\"MMMYYYY\"))","v":"CUMMINS_GLOBAL_PACKAGING_DATA_SHEET_REV_002_MAY2021"},"NPBU - New Power, Mississauga, Ontario, CAN added to receiving locations"]
["2021-12-13","CUMMINS_GLOBAL_PACKAGING_DATA_SHEET_REV_002",{"$f":"$B10&\"_\"&UPPER(TEXT($A10,\"MMMYYYY\"))","v":"CUMMINS_GLOBAL_PACKAGING_DATA_SHEET_REV_002_DEC2021"},"CES - ESN Cummins Emission Solutions - Beringe, Netherlands added to receiving locations\n\nCheck Requirements aligned to GPS-PP"]
["2022-03-14","CUMMINS_GLOBAL_PACKAGING_DATA_SHEET_REV_002",{"$f":"$B11&\"_\"&UPPER(TEXT($A11,\"MMMYYYY\"))","v":"CUMMINS_GLOBAL_PACKAGING_DATA_SHEET_REV_002_MAR2022"},"Added receiving location - RECON SEZ - Pithampur, India"]